Hugo_Symbol,Sequencing_Panel,NCBI_Build,Chromosome,Start_Position,End_Position,Variant_Classification,Variant_Type,Reference_Allele,Tumor_Seq_Allele2,Tumor_Sample_Barcode,patient_ID,Seq_approach,Mutation_ID,Mutation_ID_region,t_depth,t_alt_count,t_ref_count,vAF,n_depth,n_alt_count,n_ref_count,cohort,OncoKB_mutationeffect,OncoKB_oncogenicstatus,OncoKB_evidencelvl,OncoKB_citations,cn_dipLogR,cn_segment.mean,tcn,lcn,Purity,Ploidy,CCF,CCF_95up,CCF_95low,added_manualreview
VHL,MSK-IMPACT,GRCh37.75,3,10188260,10188260,Frame_Shift_Del,DEL,T,-,RCC001_T1,RCC001,MR,RCC001_VHL_10188260_T_-,RCC001_T1_VHL_10188260_T_-,510,246,264,0.482352941,730,0,730,MSKCC,Likely Loss-of-function,Likely Oncogenic,,21386872;12004076;12050673;22825683,0.241796423,-0.305123604,1,0,0.65170289,1.526445596,0.998,1,0.944,0
VHL,MSK-IMPACT,GRCh37.75,3,10188260,10188260,Frame_Shift_Del,DEL,T,-,RCC001_T2,RCC001,MR,RCC001_VHL_10188260_T_-,RCC001_T2_VHL_10188260_T_-,547,235,312,0.429616088,730,0,730,MSKCC,Likely Loss-of-function,Likely Oncogenic,,21386872;12004076;12050673;22825683,0.229892236,-0.335478591,1,0,0.628818092,1.531497522,0.937,0.992,0.882,0
VHL,MSK-IMPACT,GRCh37.75,3,10188260,10188260,Frame_Shift_Del,DEL,T,-,RCC001_T3,RCC001,MR,RCC001_VHL_10188260_T_-,RCC001_T3_VHL_10188260_T_-,567,256,311,0.451499118,730,0,730,MSKCC,Likely Loss-of-function,Likely Oncogenic,,21386872;12004076;12050673;22825683,0.243008079,-0.301086825,1,0,0.626675698,1.505267723,0.989,1,0.935,0
VHL,MSK-IMPACT,GRCh37.75,3,10188260,10188260,Frame_Shift_Del,DEL,T,-,RCC001_T4,RCC001,MR,RCC001_VHL_10188260_T_-,RCC001_T4_VHL_10188260_T_-,692,372,320,0.537572254,730,0,730,MSKCC,Likely Loss-of-function,Likely Oncogenic,,21386872;12004076;12050673;22825683,0.294682006,-0.329263517,1,0,0.696920891,1.469816462,1,1,0.963,0
VHL,MSK-IMPACT,GRCh37.75,3,10188260,10188260,Frame_Shift_Del,DEL,T,-,RCC001_T5,RCC001,MR,RCC001_VHL_10188260_T_-,RCC001_T5_VHL_10188260_T_-,640,330,310,0.515625,730,0,730,MSKCC,Likely Loss-of-function,Likely Oncogenic,,21386872;12004076;12050673;22825683,0.283931019,-0.353270046,1,0,0.68899551,1.48141889,0.981,1,0.936,0
VHL,MSK-IMPACT,GRCh37.75,3,10188260,10188260,Frame_Shift_Del,DEL,T,-,RCC001_T6,RCC001,MR,RCC001_VHL_10188260_T_-,RCC001_T6_VHL_10188260_T_-,519,253,266,0.487475915,730,0,730,MSKCC,Likely Loss-of-function,Likely Oncogenic,,21386872;12004076;12050673;22825683,0.234833123,-0.370309932,1,0,0.674566195,1.554627218,0.958,1,0.907,0
VHL,MSK-IMPACT,GRCh37.75,3,10188260,10188260,Frame_Shift_Del,DEL,T,-,RCC001_T7,RCC001,POOL,RCC001_VHL_10188260_T_-,RCC001_T7_VHL_10188260_T_-,593,274,319,0.462057336,730,0,730,MSKCC,Likely Loss-of-function,Likely Oncogenic,,21386872;12004076;12050673;22825683,0.264103032,-0.3305689,1,0,0.664530771,1.496535878,0.929,0.978,0.88,0
VHL,MSK-IMPACT,GRCh37.75,3,10183838,10183838,In_Frame_Del,DEL,CCTGGCA,C,RCC002_T1,RCC002,MR,RCC002_VHL_10183838_CCTGGCA_C,RCC002_T1_VHL_10183838_CCTGGCA_C,192,74,118,0.385416667,378,0,378,MSKCC,,,,,0.001489167,-0.433810132,1,0,0.531048941,1.996114561,1,1,0.936,0
VHL,MSK-IMPACT,GRCh37.75,3,10183845,10183845,Missense_Mutation,SNP,C,A,RCC002_T1,RCC002,MR,RCC002_VHL_10183845_C_A,RCC002_T1_VHL_10183845_C_A,157,59,98,0.375796178,301,1,300,MSKCC,,,,,0.001489167,-0.433810132,1,0,0.531048941,1.996114561,1,1,0.91,0
VHL,MSK-IMPACT,GRCh37.75,3,10183838,10183838,In_Frame_Del,DEL,CCTGGCA,C,RCC002_T2,RCC002,MR,RCC002_VHL_10183838_CCTGGCA_C,RCC002_T2_VHL_10183838_CCTGGCA_C,241,104,137,0.43153527,378,0,378,MSKCC,,,,,0.002972718,-0.495889011,1,0,0.587109722,1.99298799,1,1,0.941,0
VHL,MSK-IMPACT,GRCh37.75,3,10183845,10183845,Missense_Mutation,SNP,C,A,RCC002_T2,RCC002,MR,RCC002_VHL_10183845_C_A,RCC002_T2_VHL_10183845_C_A,194,76,118,0.391752577,301,1,300,MSKCC,,,,,0.002972718,-0.495889011,1,0,0.587109722,1.99298799,0.943,1,0.844,0
VHL,MSK-IMPACT,GRCh37.75,3,10183838,10183838,In_Frame_Del,DEL,CCTGGCA,C,RCC002_T3,RCC002,MR,RCC002_VHL_10183838_CCTGGCA_C,RCC002_T3_VHL_10183838_CCTGGCA_C,251,101,150,0.402390438,378,0,378,MSKCC,,,,,0.015923848,-0.483658048,1,0,0.581226119,1.962228539,0.982,1,0.894,0
VHL,MSK-IMPACT,GRCh37.75,3,10183845,10183845,Missense_Mutation,SNP,C,A,RCC002_T3,RCC002,MR,RCC002_VHL_10183845_C_A,RCC002_T3_VHL_10183845_C_A,219,86,133,0.392694064,301,1,300,MSKCC,,,,,0.015923848,-0.483658048,1,0,0.581226119,1.962228539,0.959,1,0.864,0
VHL,MSK-IMPACT,GRCh37.75,3,10183838,10183838,In_Frame_Del,DEL,CCTGGCA,C,RCC002_T4,RCC002,MR,RCC002_VHL_10183838_CCTGGCA_C,RCC002_T4_VHL_10183838_CCTGGCA_C,459,165,294,0.359477124,324,1,323,MSKCC,,,,,0.028878898,-0.500898887,1,0,0.617062584,1.935765639,0.806,0.866,0.747,0
VHL,MSK-IMPACT,GRCh37.75,3,10183845,10183845,Missense_Mutation,SNP,C,A,RCC002_T4,RCC002,MR,RCC002_VHL_10183845_C_A,RCC002_T4_VHL_10183845_C_A,454,172,280,0.378854626,301,1,300,MSKCC,,,,,0.028878898,-0.500898887,1,0,0.617062584,1.935765639,0.853,0.914,0.793,0
VHL,MSK-IMPACT,GRCh37.75,3,10183838,10183838,In_Frame_Del,DEL,CCTGGCA,C,RCC002_T5,RCC002,MR,RCC002_VHL_10183838_CCTGGCA_C,RCC002_T5_VHL_10183838_CCTGGCA_C,160,60,100,0.375,324,1,323,MSKCC,,,,,-0.012884548,-0.560890259,1,0,0.621479594,2.028869451,0.832,0.934,0.733,0
VHL,MSK-IMPACT,GRCh37.75,3,10183845,10183845,Missense_Mutation,SNP,C,A,RCC002_T5,RCC002,MR,RCC002_VHL_10183845_C_A,RCC002_T5_VHL_10183845_C_A,166,64,102,0.385542169,301,1,300,MSKCC,,,,,-0.012884548,-0.560890259,1,0,0.621479594,2.028869451,0.855,0.956,0.758,0
VHL,MSK-IMPACT,GRCh37.75,3,10183838,10183838,In_Frame_Del,DEL,CCTGGCA,C,RCC002_T6,RCC002,MR,RCC002_VHL_10183838_CCTGGCA_C,RCC002_T6_VHL_10183838_CCTGGCA_C,154,66,88,0.428571429,324,1,323,MSKCC,,,,,0.009448429,-0.524389271,1,0,0.612379469,1.978680692,0.971,1,0.865,0
VHL,MSK-IMPACT,GRCh37.75,3,10183845,10183845,Missense_Mutation,SNP,C,A,RCC002_T6,RCC002,MR,RCC002_VHL_10183845_C_A,RCC002_T6_VHL_10183845_C_A,157,73,84,0.464968153,301,1,300,MSKCC,,,,,0.009448429,-0.524389271,1,0,0.612379469,1.978680692,1,1,0.935,0
VHL,MSK-IMPACT,GRCh37.75,3,10183838,10183838,In_Frame_Del,DEL,CCTGGCA,C,RCC002_T7,RCC002,POOL,RCC002_VHL_10183838_CCTGGCA_C,RCC002_T7_VHL_10183838_CCTGGCA_C,202,68,134,0.336633663,324,1,323,MSKCC,,,,,0.013605043,-0.484433312,1,0,0.589293322,1.968144992,0.806,0.902,0.714,0
VHL,MSK-IMPACT,GRCh37.75,3,10183845,10183845,Missense_Mutation,SNP,C,A,RCC002_T7,RCC002,POOL,RCC002_VHL_10183845_C_A,RCC002_T7_VHL_10183845_C_A,207,73,134,0.352657005,301,1,300,MSKCC,,,,,0.013605043,-0.484433312,1,0,0.589293322,1.968144992,0.844,0.94,0.752,0
ERCC4,MSK-IMPACT,GRCh37.75,16,14022033,14022033,Missense_Mutation,SNP,C,G,RCC003_T1,RCC003,MR,RCC003_ERCC4_14022033_C_G,RCC003_T1_ERCC4_14022033_C_G,975,75,898,0.076923077,454,0,454,MSKCC,,,,,0.025927212,0.01334624,2,1,NA,2,NA,NA,NA,0
EP300,MSK-IMPACT,GRCh37.75,22,41562637,41562637,Nonsense_Mutation,SNP,C,T,RCC003_T1,RCC003,MR,RCC003_EP300_41562637_C_T,RCC003_T1_EP300_41562637_C_T,733,67,666,0.091405184,362,1,361,MSKCC,Likely Loss-of-function,Likely Oncogenic,,10700188;12237408;15156177;12402157,0.025927212,0.038743631,2,1,NA,2,NA,NA,NA,0
EP300,MSK-IMPACT,GRCh37.75,22,41574354,41574354,Frame_Shift_Del,DEL,AC,A,RCC003_T1,RCC003,MR,RCC003_EP300_41574354_AC_A,RCC003_T1_EP300_41574354_AC_A,907,64,843,0.070562293,492,0,492,MSKCC,Likely Loss-of-function,Likely Oncogenic,,10700188;12237408;15156177;12402157,0.025927212,0.038743631,2,1,NA,2,NA,NA,NA,0
VHL,MSK-IMPACT,GRCh37.75,3,10191466,10191466,Splice_Site,DEL,TCCAGTGTATA,T,RCC003_T1,RCC003,MR,RCC003_VHL_10191466_TCCAGTGTATA_T,RCC003_T1_VHL_10191466_TCCAGTGTATA_T,513,31,482,0.06042885,332,0,332,MSKCC,Likely Loss-of-function,Likely Oncogenic,,21386872;12004076;12050673;22825683,0.025927212,-0.096779118,1,0,NA,2,NA,NA,NA,0
PBRM1,MSK-IMPACT,GRCh37.75,3,52598074,52598074,Nonsense_Mutation,SNP,G,T,RCC003_T1,RCC003,MR,RCC003_PBRM1_52598074_G_T,RCC003_T1_PBRM1_52598074_G_T,927,84,842,0.090614887,584,1,583,MSKCC,Likely Loss-of-function,Likely Oncogenic,,21248752;18339845;24613357;22949125;21654818,0.025927212,-0.096779118,1,0,NA,2,NA,NA,NA,0
PDGFRA,MSK-IMPACT,GRCh37.75,4,55136809,55136809,Frame_Shift_Del,DEL,CA,C,RCC003_T1,RCC003,MR,RCC003_PDGFRA_55136809_CA_C,RCC003_T1_PDGFRA_55136809_CA_C,877,69,808,0.078677309,452,0,452,MSKCC,,,,,0.025927212,-0.009725231,2,1,NA,2,NA,NA,NA,0
KDM6A,MSK-IMPACT,GRCh37.75,X,44929002,44929002,Missense_Mutation,SNP,C,T,RCC003_T1,RCC003,MR,RCC003_KDM6A_44929002_C_T,RCC003_T1_KDM6A_44929002_C_T,663,105,557,0.158371041,364,1,363,MSKCC,,,,,0.025927212,0.027280357,1,0,NA,2,NA,NA,NA,0
ERCC4,MSK-IMPACT,GRCh37.75,16,14022033,14022033,Missense_Mutation,SNP,C,G,RCC003_T2,RCC003,MR,RCC003_ERCC4_14022033_C_G,RCC003_T2_ERCC4_14022033_C_G,893,83,808,0.092945129,454,0,454,MSKCC,,,,,0.038374737,0.052048162,2,1,0.222445271,1.763998629,0.838,0.945,0.738,0
EP300,MSK-IMPACT,GRCh37.75,22,41562637,41562637,Nonsense_Mutation,SNP,C,T,RCC003_T2,RCC003,MR,RCC003_EP300_41562637_C_T,RCC003_T2_EP300_41562637_C_T,704,73,631,0.103693182,362,1,361,MSKCC,Likely Loss-of-function,Likely Oncogenic,,10700188;12237408;15156177;12402157,0.038374737,0.055721746,2,1,0.222445271,1.763998629,0.932,1,0.815,0
EP300,MSK-IMPACT,GRCh37.75,22,41574354,41574354,Frame_Shift_Del,DEL,AC,A,RCC003_T2,RCC003,MR,RCC003_EP300_41574354_AC_A,RCC003_T2_EP300_41574354_AC_A,850,91,759,0.107058824,492,0,492,MSKCC,Likely Loss-of-function,Likely Oncogenic,,10700188;12237408;15156177;12402157,0.038374737,0.055721746,2,1,0.222445271,1.763998629,0.963,1,0.854,0
VHL,MSK-IMPACT,GRCh37.75,3,10191466,10191466,Splice_Site,DEL,TCCAGTGTATA,T,RCC003_T2,RCC003,MR,RCC003_VHL_10191466_TCCAGTGTATA_T,RCC003_T2_VHL_10191466_TCCAGTGTATA_T,496,46,450,0.092741935,332,0,332,MSKCC,Likely Loss-of-function,Likely Oncogenic,,21386872;12004076;12050673;22825683,0.038374737,-0.122072131,1,0,0.222445271,1.763998629,0.741,0.87,0.624,0
PBRM1,MSK-IMPACT,GRCh37.75,3,52598074,52598074,Nonsense_Mutation,SNP,G,T,RCC003_T2,RCC003,MR,RCC003_PBRM1_52598074_G_T,RCC003_T2_PBRM1_52598074_G_T,904,87,815,0.096238938,584,1,583,MSKCC,Likely Loss-of-function,Likely Oncogenic,,21248752;18339845;24613357;22949125;21654818,0.038374737,-0.122072131,1,0,0.222445271,1.763998629,0.771,0.867,0.681,0
PDGFRA,MSK-IMPACT,GRCh37.75,4,55136809,55136809,Frame_Shift_Del,DEL,CA,C,RCC003_T2,RCC003,MR,RCC003_PDGFRA_55136809_CA_C,RCC003_T2_PDGFRA_55136809_CA_C,818,91,727,0.111246944,452,0,452,MSKCC,,,,,0.038374737,-0.006851268,2,1,0.222445271,1.763998629,1,1,0.887,0
KDM6A,MSK-IMPACT,GRCh37.75,X,44929002,44929002,Missense_Mutation,SNP,C,T,RCC003_T2,RCC003,MR,RCC003_KDM6A_44929002_C_T,RCC003_T2_KDM6A_44929002_C_T,719,158,561,0.219749652,364,1,363,MSKCC,,,,,0.038374737,0.020931386,1,0,0.222445271,1.763998629,1,1,0.991,0
ERCC4,MSK-IMPACT,GRCh37.75,16,14022033,14022033,Missense_Mutation,SNP,C,G,RCC003_T3,RCC003,MR,RCC003_ERCC4_14022033_C_G,RCC003_T3_ERCC4_14022033_C_G,851,101,749,0.118683901,454,0,454,MSKCC,,,,,0.013162345,0.177355609,3,1,0.259290272,1.92994762,0.518,0.577,0.462,0
EP300,MSK-IMPACT,GRCh37.75,22,41562637,41562637,Nonsense_Mutation,SNP,C,T,RCC003_T3,RCC003,MR,RCC003_EP300_41562637_C_T,RCC003_T3_EP300_41562637_C_T,700,67,631,0.095714286,362,1,361,MSKCC,Likely Loss-of-function,Likely Oncogenic,,10700188;12237408;15156177;12402157,0.013162345,0.087121957,2,1,0.259290272,1.92994762,0.74,0.846,0.643,0
EP300,MSK-IMPACT,GRCh37.75,22,41574354,41574354,Frame_Shift_Del,DEL,AC,A,RCC003_T3,RCC003,MR,RCC003_EP300_41574354_AC_A,RCC003_T3_EP300_41574354_AC_A,869,104,765,0.119677791,492,0,492,MSKCC,Likely Loss-of-function,Likely Oncogenic,,10700188;12237408;15156177;12402157,0.013162345,0.087121957,2,1,0.259290272,1.92994762,0.923,1,0.826,0
VHL,MSK-IMPACT,GRCh37.75,3,10191466,10191466,Splice_Site,DEL,TCCAGTGTATA,T,RCC003_T3,RCC003,MR,RCC003_VHL_10191466_TCCAGTGTATA_T,RCC003_T3_VHL_10191466_TCCAGTGTATA_T,531,55,476,0.103578154,332,0,332,MSKCC,Likely Loss-of-function,Likely Oncogenic,,21386872;12004076;12050673;22825683,0.013162345,-0.001726518,2,NA,0.259290272,1.92994762,0.799,1,NA,0
PBRM1,MSK-IMPACT,GRCh37.75,3,52598074,52598074,Nonsense_Mutation,SNP,G,T,RCC003_T3,RCC003,MR,RCC003_PBRM1_52598074_G_T,RCC003_T3_PBRM1_52598074_G_T,904,112,791,0.123893805,584,1,583,MSKCC,Likely Loss-of-function,Likely Oncogenic,,21248752;18339845;24613357;22949125;21654818,0.013162345,-0.140441073,1,0,0.259290272,1.92994762,0.833,0.922,0.748,0
PDGFRA,MSK-IMPACT,GRCh37.75,4,55136809,55136809,Frame_Shift_Del,DEL,CA,C,RCC003_T3,RCC003,MR,RCC003_PDGFRA_55136809_CA_C,RCC003_T3_PDGFRA_55136809_CA_C,740,106,634,0.143243243,452,0,452,MSKCC,,,,,0.013162345,-0.06598265,2,1,0.259290272,1.92994762,1,1,0.952,0
KDM6A,MSK-IMPACT,GRCh37.75,X,44929002,44929002,Missense_Mutation,SNP,C,T,RCC003_T3,RCC003,MR,RCC003_KDM6A_44929002_C_T,RCC003_T3_KDM6A_44929002_C_T,652,164,488,0.251533742,364,1,363,MSKCC,,,,,0.013162345,0.02518724,1,0,0.259290272,1.92994762,1,1,0.991,0
ERCC4,MSK-IMPACT,GRCh37.75,16,14022033,14022033,Missense_Mutation,SNP,C,G,RCC003_T4,RCC003,MR,RCC003_ERCC4_14022033_C_G,RCC003_T4_ERCC4_14022033_C_G,937,137,799,0.146211313,454,0,454,MSKCC,,,,,0.002484546,0.018216406,2,1,0.37007707,1.990700995,0.791,0.867,0.719,0
EP300,MSK-IMPACT,GRCh37.75,22,41562637,41562637,Nonsense_Mutation,SNP,C,T,RCC003_T4,RCC003,MR,RCC003_EP300_41562637_C_T,RCC003_T4_EP300_41562637_C_T,835,133,701,0.159281437,362,1,361,MSKCC,Likely Loss-of-function,Likely Oncogenic,,10700188;12237408;15156177;12402157,0.002484546,0.129684038,3,1,0.37007707,1.990700995,0.511,0.56,0.464,0
EP300,MSK-IMPACT,GRCh37.75,22,41574354,41574354,Frame_Shift_Del,DEL,AC,A,RCC003_T4,RCC003,MR,RCC003_EP300_41574354_AC_A,RCC003_T4_EP300_41574354_AC_A,1025,182,843,0.177560976,493,0,493,MSKCC,Likely Loss-of-function,Likely Oncogenic,,10700188;12237408;15156177;12402157,0.002484546,0.129684038,3,1,0.37007707,1.990700995,0.569,0.615,0.524,0
VHL,MSK-IMPACT,GRCh37.75,3,10191466,10191466,Splice_Site,DEL,TCCAGTGTATA,T,RCC003_T4,RCC003,MR,RCC003_VHL_10191466_TCCAGTGTATA_T,RCC003_T4_VHL_10191466_TCCAGTGTATA_T,543,93,450,0.171270718,332,0,332,MSKCC,Likely Loss-of-function,Likely Oncogenic,,21386872;12004076;12050673;22825683,0.002484546,-0.206599799,1,0,0.37007707,1.990700995,0.754,0.841,0.672,0
PBRM1,MSK-IMPACT,GRCh37.75,3,52598074,52598074,Nonsense_Mutation,SNP,G,T,RCC003_T4,RCC003,MR,RCC003_PBRM1_52598074_G_T,RCC003_T4_PBRM1_52598074_G_T,961,210,750,0.218522373,584,1,583,MSKCC,Likely Loss-of-function,Likely Oncogenic,,21248752;18339845;24613357;22949125;21654818,0.002484546,-0.206599799,1,0,0.37007707,1.990700995,0.963,1,0.895,0
PDGFRA,MSK-IMPACT,GRCh37.75,4,55136809,55136809,Frame_Shift_Del,DEL,CA,C,RCC003_T4,RCC003,MR,RCC003_PDGFRA_55136809_CA_C,RCC003_T4_PDGFRA_55136809_CA_C,894,136,758,0.15212528,452,0,452,MSKCC,,,,,0.002484546,-0.039786506,2,1,0.37007707,1.990700995,0.822,0.901,0.747,0
KDM6A,MSK-IMPACT,GRCh37.75,X,44929002,44929002,Missense_Mutation,SNP,C,T,RCC003_T4,RCC003,MR,RCC003_KDM6A_44929002_C_T,RCC003_T4_KDM6A_44929002_C_T,762,317,445,0.416010499,364,1,363,MSKCC,,,,,0.002484546,0.045839626,1,0,0.37007707,1.990700995,1,1,0.996,0
ERCC4,MSK-IMPACT,GRCh37.75,16,14022033,14022033,Missense_Mutation,SNP,C,G,RCC003_T5,RCC003,MR,RCC003_ERCC4_14022033_C_G,RCC003_T5_ERCC4_14022033_C_G,942,62,879,0.06581741,454,0,454,MSKCC,,,,,0.057449063,0.046061143,2,1,NA,2,NA,NA,NA,0
EP300,MSK-IMPACT,GRCh37.75,22,41562637,41562637,Nonsense_Mutation,SNP,C,T,RCC003_T5,RCC003,MR,RCC003_EP300_41562637_C_T,RCC003_T5_EP300_41562637_C_T,835,67,767,0.080239521,362,1,361,MSKCC,Likely Loss-of-function,Likely Oncogenic,,10700188;12237408;15156177;12402157,0.057449063,0.119638499,2,1,NA,2,NA,NA,NA,0
EP300,MSK-IMPACT,GRCh37.75,22,41574354,41574354,Frame_Shift_Del,DEL,AC,A,RCC003_T5,RCC003,MR,RCC003_EP300_41574354_AC_A,RCC003_T5_EP300_41574354_AC_A,945,93,852,0.098412698,491,0,491,MSKCC,Likely Loss-of-function,Likely Oncogenic,,10700188;12237408;15156177;12402157,0.057449063,0.119638499,2,1,NA,2,NA,NA,NA,0
VHL,MSK-IMPACT,GRCh37.75,3,10191466,10191466,Splice_Site,DEL,TCCAGTGTATA,T,RCC003_T5,RCC003,MR,RCC003_VHL_10191466_TCCAGTGTATA_T,RCC003_T5_VHL_10191466_TCCAGTGTATA_T,598,40,558,0.066889632,332,0,332,MSKCC,Likely Loss-of-function,Likely Oncogenic,,21386872;12004076;12050673;22825683,0.057449063,-0.093175684,1,0,NA,2,NA,NA,NA,0
PBRM1,MSK-IMPACT,GRCh37.75,3,52598074,52598074,Nonsense_Mutation,SNP,G,T,RCC003_T5,RCC003,MR,RCC003_PBRM1_52598074_G_T,RCC003_T5_PBRM1_52598074_G_T,1032,100,932,0.096899225,584,1,583,MSKCC,Likely Loss-of-function,Likely Oncogenic,,21248752;18339845;24613357;22949125;21654818,0.057449063,-0.093175684,1,0,NA,2,NA,NA,NA,0
PDGFRA,MSK-IMPACT,GRCh37.75,4,55136809,55136809,Frame_Shift_Del,DEL,CA,C,RCC003_T5,RCC003,MR,RCC003_PDGFRA_55136809_CA_C,RCC003_T5_PDGFRA_55136809_CA_C,895,60,835,0.067039106,452,0,452,MSKCC,,,,,0.057449063,-0.049183497,2,1,NA,2,NA,NA,NA,0
KDM6A,MSK-IMPACT,GRCh37.75,X,44929002,44929002,Missense_Mutation,SNP,C,T,RCC003_T5,RCC003,MR,RCC003_KDM6A_44929002_C_T,RCC003_T5_KDM6A_44929002_C_T,714,126,587,0.176470588,364,1,363,MSKCC,,,,,0.057449063,0.023240407,1,0,NA,2,NA,NA,NA,0
ERCC4,MSK-IMPACT,GRCh37.75,16,14022033,14022033,Missense_Mutation,SNP,C,G,RCC003_T6,RCC003,MR,RCC003_ERCC4_14022033_C_G,RCC003_T6_ERCC4_14022033_C_G,931,76,854,0.081632653,454,0,454,MSKCC,,,,,0.03409508,-0.006406855,2,1,0.237116366,1.803001042,0.689,0.782,0.603,0
EP300,MSK-IMPACT,GRCh37.75,22,41562637,41562637,Nonsense_Mutation,SNP,C,T,RCC003_T6,RCC003,MR,RCC003_EP300_41562637_C_T,RCC003_T6_EP300_41562637_C_T,788,70,718,0.088832487,362,1,361,MSKCC,Likely Loss-of-function,Likely Oncogenic,,10700188;12237408;15156177;12402157,0.03409508,0.087554634,2,1,0.237116366,1.803001042,0.749,0.854,0.652,0
EP300,MSK-IMPACT,GRCh37.75,22,41574354,41574354,Frame_Shift_Del,DEL,AC,A,RCC003_T6,RCC003,MR,RCC003_EP300_41574354_AC_A,RCC003_T6_EP300_41574354_AC_A,873,75,798,0.085910653,491,0,491,MSKCC,Likely Loss-of-function,Likely Oncogenic,,10700188;12237408;15156177;12402157,0.03409508,0.087554634,2,1,0.237116366,1.803001042,0.725,0.823,0.634,0
VHL,MSK-IMPACT,GRCh37.75,3,10191466,10191466,Splice_Site,DEL,TCCAGTGTATA,T,RCC003_T6,RCC003,MR,RCC003_VHL_10191466_TCCAGTGTATA_T,RCC003_T6_VHL_10191466_TCCAGTGTATA_T,548,31,517,0.056569343,332,0,332,MSKCC,Likely Loss-of-function,Likely Oncogenic,,21386872;12004076;12050673;22825683,0.03409508,-0.108748382,1,0,0.237116366,1.803001042,0.421,0.513,0.339,0
PBRM1,MSK-IMPACT,GRCh37.75,3,52598074,52598074,Nonsense_Mutation,SNP,G,T,RCC003_T6,RCC003,MR,RCC003_PBRM1_52598074_G_T,RCC003_T6_PBRM1_52598074_G_T,935,84,849,0.089839572,584,1,583,MSKCC,Likely Loss-of-function,Likely Oncogenic,,21248752;18339845;24613357;22949125;21654818,0.03409508,-0.108748382,1,0,0.237116366,1.803001042,0.669,0.755,0.59,0
PDGFRA,MSK-IMPACT,GRCh37.75,4,55136809,55136809,Frame_Shift_Del,DEL,CA,C,RCC003_T6,RCC003,MR,RCC003_PDGFRA_55136809_CA_C,RCC003_T6_PDGFRA_55136809_CA_C,856,67,789,0.078271028,452,0,452,MSKCC,,,,,0.03409508,-0.088842147,0,0,0.237116366,1.803001042,0.504,1,NA,0
KDM6A,MSK-IMPACT,GRCh37.75,X,44929002,44929002,Missense_Mutation,SNP,C,T,RCC003_T6,RCC003,MR,RCC003_KDM6A_44929002_C_T,RCC003_T6_KDM6A_44929002_C_T,680,120,560,0.176470588,364,1,363,MSKCC,,,,,0.03409508,0.028741905,1,0,0.237116366,1.803001042,1,1,0.979,0
ERCC4,MSK-IMPACT,GRCh37.75,16,14022033,14022033,Missense_Mutation,SNP,C,G,RCC003_T7,RCC003,POOL,RCC003_ERCC4_14022033_C_G,RCC003_T7_ERCC4_14022033_C_G,1275,129,1145,0.101176471,454,0,454,MSKCC,,,,,0.023581819,0.012391045,2,1,0.241588071,1.865781404,0.838,0.924,0.758,0
EP300,MSK-IMPACT,GRCh37.75,22,41562637,41562637,Nonsense_Mutation,SNP,C,T,RCC003_T7,RCC003,POOL,RCC003_EP300_41562637_C_T,RCC003_T7_EP300_41562637_C_T,1007,97,909,0.09632572,362,1,361,MSKCC,Likely Loss-of-function,Likely Oncogenic,,10700188;12237408;15156177;12402157,0.023581819,0.091852785,2,1,0.241588071,1.865781404,0.798,0.893,0.71,0
EP300,MSK-IMPACT,GRCh37.75,22,41574354,41574354,Frame_Shift_Del,DEL,AC,A,RCC003_T7,RCC003,POOL,RCC003_EP300_41574354_AC_A,RCC003_T7_EP300_41574354_AC_A,1150,121,1029,0.105217391,492,0,492,MSKCC,Likely Loss-of-function,Likely Oncogenic,,10700188;12237408;15156177;12402157,0.023581819,0.091852785,2,1,0.241588071,1.865781404,0.871,0.962,0.785,0
VHL,MSK-IMPACT,GRCh37.75,3,10191466,10191466,Splice_Site,DEL,TCCAGTGTATA,T,RCC003_T7,RCC003,POOL,RCC003_VHL_10191466_TCCAGTGTATA_T,RCC003_T7_VHL_10191466_TCCAGTGTATA_T,762,79,683,0.103674541,332,0,332,MSKCC,Likely Loss-of-function,Likely Oncogenic,,21386872;12004076;12050673;22825683,0.023581819,-0.114366713,1,0,0.241588071,1.865781404,0.755,0.853,0.663,0
PBRM1,MSK-IMPACT,GRCh37.75,3,52598074,52598074,Nonsense_Mutation,SNP,G,T,RCC003_T7,RCC003,POOL,RCC003_PBRM1_52598074_G_T,RCC003_T7_PBRM1_52598074_G_T,1169,133,1035,0.113772455,584,1,583,MSKCC,Likely Loss-of-function,Likely Oncogenic,,21248752;18339845;24613357;22949125;21654818,0.023581819,-0.114366713,1,0,0.241588071,1.865781404,0.829,0.911,0.751,0
PDGFRA,MSK-IMPACT,GRCh37.75,4,55136809,55136809,Frame_Shift_Del,DEL,CA,C,RCC003_T7,RCC003,POOL,RCC003_PDGFRA_55136809_CA_C,RCC003_T7_PDGFRA_55136809_CA_C,1126,148,978,0.131438721,448,0,448,MSKCC,,,,,0.023581819,-0.032769438,2,1,0.241588071,1.865781404,1,1,0.959,0
KDM6A,MSK-IMPACT,GRCh37.75,X,44929002,44929002,Missense_Mutation,SNP,C,T,RCC003_T7,RCC003,POOL,RCC003_KDM6A_44929002_C_T,RCC003_T7_KDM6A_44929002_C_T,946,209,736,0.220930233,364,1,363,MSKCC,,,,,0.023581819,0.027180133,1,0,0.241588071,1.865781404,1,1,0.992,0
ERBB2,MSK-IMPACT,GRCh37.75,17,37883638,37883638,Missense_Mutation,SNP,G,T,RCC004_T1,RCC004,MR,RCC004_ERBB2_37883638_G_T,RCC004_T1_ERBB2_37883638_G_T,1035,305,729,0.29468599,538,0,538,MSKCC,,,,,0.020003349,0.056607817,2,1,0.542257162,1.94921382,1,1,0.981,0
TP53,MSK-IMPACT,GRCh37.75,17,7579368,7579368,In_Frame_Del,DEL,AGCTGCCCTG,A,RCC004_T1,RCC004,MR,RCC004_TP53_7579368_AGCTGCCCTG_A,RCC004_T1_TP53_7579368_AGCTGCCCTG_A,532,60,472,0.112781955,362,0,362,MSKCC,,,,,0.020003349,-0.346065055,1,0,0.542257162,1.94921382,0.303,0.349,0.261,0
VHL,MSK-IMPACT,GRCh37.75,3,10183752,10183752,In_Frame_Del,DEL,TCATCTTCTG,T,RCC004_T1,RCC004,MR,RCC004_VHL_10183752_TCATCTTCTG_T,RCC004_T1_VHL_10183752_TCATCTTCTG_T,528,149,379,0.28219697,360,1,359,MSKCC,,,,,0.020003349,-0.419497234,1,0,0.542257162,1.94921382,0.759,0.822,0.697,0
TSC1,MSK-IMPACT,GRCh37.75,9,135777016,135777016,Frame_Shift_Del,DEL,AC,A,RCC004_T1,RCC004,MR,RCC004_TSC1_135777016_AC_A,RCC004_T1_TSC1_135777016_AC_A,759,232,527,0.305665349,543,0,543,MSKCC,Likely Loss-of-function,Likely Oncogenic,LEVEL_2A,23485365;24529379;20301399;26831717,0.020003349,-0.453538072,1,0,0.542257162,1.94921382,0.822,0.876,0.769,0
ERBB2,MSK-IMPACT,GRCh37.75,17,37883638,37883638,Missense_Mutation,SNP,G,T,RCC004_T2,RCC004,MR,RCC004_ERBB2_37883638_G_T,RCC004_T2_ERBB2_37883638_G_T,817,64,751,0.078335373,538,0,538,MSKCC,,,,,-0.016655689,0.022888657,2,1,NA,2,NA,NA,NA,0
TP53,MSK-IMPACT,GRCh37.75,17,7578535,7578535,Missense_Mutation,SNP,T,A,RCC004_T2,RCC004,MR,RCC004_TP53_7578535_T_A,RCC004_T2_TP53_7578535_T_A,488,61,427,0.125,334,1,333,MSKCC,,,,,-0.016655689,0.022888657,2,1,NA,2,NA,NA,NA,0
VHL,MSK-IMPACT,GRCh37.75,3,10183752,10183752,In_Frame_Del,DEL,TCATCTTCTG,T,RCC004_T2,RCC004,MR,RCC004_VHL_10183752_TCATCTTCTG_T,RCC004_T2_VHL_10183752_TCATCTTCTG_T,670,34,636,0.050746269,342,1,341,MSKCC,,,,,-0.016655689,-0.059009523,2,1,NA,2,NA,NA,NA,0
BAP1,MSK-IMPACT,GRCh37.75,3,52443892,52443892,Translation_Start_Site,SNP,C,T,RCC004_T2,RCC004,MR,RCC004_BAP1_52443892_C_T,RCC004_T2_BAP1_52443892_C_T,644,44,599,0.068322981,387,0,387,MSKCC,Likely Loss-of-function,Likely Oncogenic,,21874000;18757409,-0.016655689,-0.059009523,2,1,NA,2,NA,NA,NA,0
TSC1,MSK-IMPACT,GRCh37.75,9,135798733,135798733,Splice_Site,SNP,A,G,RCC004_T2,RCC004,MR,RCC004_TSC1_135798733_A_G,RCC004_T2_TSC1_135798733_A_G,367,21,343,0.057220708,309,1,308,MSKCC,Likely Loss-of-function,Likely Oncogenic,LEVEL_2A,23485365;24529379;20301399;26831717,-0.016655689,-0.178343381,1,0,NA,2,NA,NA,NA,0